Reaction Details
TargetSerine/threonine-protein kinase Sgk1
LigandBDBM269092
Substrate/Competitorn/a
Meas. Tech.Enzymatic Activity Assay
pH7.4±n/a
IC50 1.10±n/a nM
Commentsextracted
Citation Nazare, MHalland, NSchmidt, FKleemann, HWeiss, TSaas, JStruebing, C N-(4-(azaindazol-6-yl)-phenyl)-sulfonamides and their use as pharmaceuticals US Patent US9718825 Publication Date 8/1/2017
 
Serine/threonine-protein kinase Sgk1
Name:Serine/threonine-protein kinase Sgk1
Type:Other Protein Type
Mol. Mass.:48954.40
Organism:Homo sapiens (Human)
Description:Recombinant human SGK-1 enzyme produced in a baculovirus system.
Residue:431
BDBM269092
NameBDBM269092
Synonyms:US9718825, Example 537
TypeSmall organic molecule
Emp. Form.C21H16Cl2N6O3S
Mol. Mass.503.361
SMILESClc1ccc(Cl)c(c1)S(=O)(=O)Nc1ccc(cc1)-c1ncc2c(NC(=O)C3CC3)n[nH]c2n1