Reaction Details
TargetSerine/threonine-protein kinase Sgk1
LigandBDBM269122
Substrate/Competitorn/a
Meas. Tech.Enzymatic Activity Assay
pH7.4±n/a
IC50 1.50±n/a nM
Commentsextracted
Citation Nazare, MHalland, NSchmidt, FKleemann, HWeiss, TSaas, JStruebing, C N-(4-(azaindazol-6-yl)-phenyl)-sulfonamides and their use as pharmaceuticals US Patent US9718825 Publication Date 8/1/2017
 
Serine/threonine-protein kinase Sgk1
Name:Serine/threonine-protein kinase Sgk1
Type:Other Protein Type
Mol. Mass.:48954.40
Organism:Homo sapiens (Human)
Description:Recombinant human SGK-1 enzyme produced in a baculovirus system.
Residue:431
BDBM269122
NameBDBM269122
Synonyms:N-[4-(3-Amino-4-trifluoromethyl-1H-pyrazolo[3,4-d]pyrimidin-6-yl)-phenyl]-5-chloro-2-fluoro-benzenesulfonamide | US9718825, Example 568
TypeSmall organic molecule
Emp. Form.C18H11ClF4N6O2S
Mol. Mass.486.831
SMILESNc1n[nH]c2nc(nc(c12)C(F)(F)F)-c1ccc(NS(=O)(=O)c2cc(Cl)ccc2F)cc1