Reaction Details
TargetSerine/threonine-protein kinase Sgk1
LigandBDBM269125
Substrate/Competitorn/a
Meas. Tech.Enzymatic Activity Assay
pH7.4±n/a
IC50<1.50±n/a nM
Commentsextracted
Citation Nazare, MHalland, NSchmidt, FKleemann, HWeiss, TSaas, JStruebing, C N-(4-(azaindazol-6-yl)-phenyl)-sulfonamides and their use as pharmaceuticals US Patent US9718825 Publication Date 8/1/2017
 
Serine/threonine-protein kinase Sgk1
Name:Serine/threonine-protein kinase Sgk1
Type:Other Protein Type
Mol. Mass.:48954.40
Organism:Homo sapiens (Human)
Description:Recombinant human SGK-1 enzyme produced in a baculovirus system.
Residue:431
BDBM269125
NameBDBM269125
Synonyms:US9718825, Example 571
TypeSmall organic molecule
Emp. Form.C21H15F3N6O3S
Mol. Mass.488.442
SMILESCOc1ccc(C#N)c(c1)S(=O)(=O)Nc1ccc(cc1)-c1cc2[nH]nc(N)c2c(n1)C(F)(F)F