Reaction Details
TargetBeta-hexosaminidase subunit alpha
LigandBDBM68268
Substrate/Competitorn/a
Meas. Tech.Enzyme Inhibition Assay
Temperature298.15±0 K
IC50 1.08e+5± 5.3e+4 nM
Citation Tropak, MBBlanchard, JEWithers, SGBrown, EDMahuran, D High-throughput screening for human lysosomal beta-N-Acetyl hexosaminidase inhibitors acting as pharmacological chaperones. Chem Biol14:153-64 (2007) 
 
Beta-hexosaminidase subunit alpha
Name:Beta-hexosaminidase subunit alpha
Type:Protein
Mol. Mass.:60688.46
Organism:Homo sapiens (Human)
Description:P06865
Residue:529
BDBM68268
NameBDBM68268
Synonyms:M-31862
TypeSmall organic molecule
Emp. Form.C20H16N2O2
Mol. Mass.316.3532
SMILESO=C1N(CCCc2ccccn2)C(=O)c2cccc3cccc1c23