Reaction Details
TargetBeta-hexosaminidase subunit alpha
LigandBDBM68271
Substrate/Competitorn/a
Meas. Tech.Enzyme Inhibition Assay
Temperature298.15±0 K
IC50 6e+2± 3e+2 nM
Citation Tropak, MBBlanchard, JEWithers, SGBrown, EDMahuran, D High-throughput screening for human lysosomal beta-N-Acetyl hexosaminidase inhibitors acting as pharmacological chaperones. Chem Biol14:153-64 (2007) 
 
Beta-hexosaminidase subunit alpha
Name:Beta-hexosaminidase subunit alpha
Type:Protein
Mol. Mass.:60688.46
Organism:Homo sapiens (Human)
Description:P06865
Residue:529
BDBM68271
NameBDBM68271
Synonyms:M-31850
TypeSmall organic molecule
Emp. Form.C17H18N2O2
Mol. Mass.282.337
SMILESCCCNCCN1C(=O)c2cccc3cccc(C1=O)c23