Reaction Details
TargetMethionine aminopeptidase 2
LigandBDBM50194621
Substrate/Competitorn/a
Meas. Tech.Enzyme Inhibiton Assay
IC50>5.00e+5±n/a nM
Citation Chen, XXie, SBhat, SKumar, NShapiro, TALiu, JO Fumagillin and fumarranol interact with P. falciparum methionine aminopeptidase 2 and inhibit malaria parasite growth in vitro and in vivo. Chem Biol16:193-202 (2009) 
 
Methionine aminopeptidase 2
Name:Methionine aminopeptidase 2
Type:Protein
Mol. Mass.:40537.47
Organism:Plasmodium falciparum
Description:Q8TA23
Residue:354
BDBM50194621
NameBDBM50194621
Synonyms:6S-(1'R,2'R-1',5'-dimethyl-1',2'-oxiranyl-4'-hexenyl)-5S-methoxy-4-oxobicyclo[3.1.0]hexane-1R-carbaldehyde Fumarranol Analog, 7
TypeSmall organic molecule
Emp. Form.C16H22O4
Mol. Mass.278.3435
SMILES[#6]-[#8][C@@]12[#6]([C@@]3([#6])[#8]-[#6@@H]3-[#6]\[#6]=[#6](\[#6])-[#6])[C@@]1([#6]-[#6]-[#6]2=O)[#6]=O