Reaction Details
TargetHypoxia-inducible factor 1-alpha
LigandBDBM66087
Substrate/Competitorn/a
Meas. Tech.Enzyme Inhibition Assay
IC50 4.5e+3± 5e+2 nM
Citation Smirnova, NARakhman, IMoroz, NBasso, MPayappilly, JKazakov, SHernandez-Guzman, FGaisina, INKozikowski, APRatan, RRGazaryan, IG Utilization of an in vivo reporter for high throughput identification of branched small molecule regulators of hypoxic adaptation. Chem Biol17:380-91 (2010) 
 
Hypoxia-inducible factor 1-alpha
Name:Hypoxia-inducible factor 1-alpha
Type:Protein
Mol. Mass.:92647.24
Organism:Homo sapiens (Human)
Description:Q16665
Residue:826
BDBM66087
NameBDBM66087
Synonyms:2-aminoethanol;6-cyclohexyl-1-hydroxy-4-methyl-2-pyridinone 2-aminoethanol;6-cyclohexyl-1-hydroxy-4-methylpyridin-2-one Ciclopirox MLS002153867 cid_38911
TypeSmall organic molecule
Emp. Form.C12H17NO2
Mol. Mass.207.2689
SMILESCc1cc(C2CCCCC2)n(O)c(=O)c1