Reaction Details
TargetSentrin-specific protease 1
LigandBDBM81513
Substrate/Competitorn/a
Meas. Tech.Fluorogenic Assay
pH8±0
Temperature310.15±0 K
IC50 2.24e+4± 2.1e+3 nM
Citation Albrow, VEPonder, ELFasci, DBékés, MDeu, ESalvesen, GSBogyo, M Development of small molecule inhibitors and probes of human SUMO deconjugating proteases. Chem Biol18:722-32 (2011) 
 
Sentrin-specific protease 1
Name:Sentrin-specific protease 1
Type:Protein
Mol. Mass.:73500.42
Organism:Homo sapiens (Human)
Description:Q9P0U3
Residue:644
BDBM81513
NameBDBM81513
Synonyms:VEA-422
TypeSmall organic molecule
Emp. Form.C38H33N5O8
Mol. Mass.687.6973
SMILESNC(=O)[C@H](CC(O)=O)NC(=O)c1ccc(cc1)C(=O)NNC(=O)[C@H]1O[C@@H]1C(=O)N(Cc1cccc2ccccc12)Cc1cccc2ccccc12