Reaction Details
TargetSentrin-specific protease 2
LigandBDBM81510
Substrate/Competitorn/a
Meas. Tech.Fluorogenic Assay
pH8±0
Temperature310.15±0 K
IC50 7.0e+3± 4e+2 nM
Citation Albrow, VEPonder, ELFasci, DBékés, MDeu, ESalvesen, GSBogyo, M Development of small molecule inhibitors and probes of human SUMO deconjugating proteases. Chem Biol18:722-32 (2011) 
 
Sentrin-specific protease 2
Name:Sentrin-specific protease 2
Type:Protein
Mol. Mass.:67890.62
Organism:Homo sapiens (Human)
Description:Q9HC62
Residue:589
BDBM81510
NameBDBM81510
Synonyms:JCP-666
TypeSmall organic molecule
Emp. Form.C44H36N4O9
Mol. Mass.764.778
SMILESOC(=O)CN(NC(=O)c1ccc(CNC(=O)c2cccc(c2)C(O)=O)cc1)C(=O)[C@H]1O[C@@H]1C(=O)N(Cc1cccc2ccccc12)Cc1cccc2ccccc12