Reaction Details
TargetSentrin-specific protease 6
LigandBDBM81513
Substrate/Competitorn/a
Meas. Tech.Fluorogenic Assay
pH8±0
Temperature310.15±0 K
IC50>1.00e+5±0 nM
Citation Albrow, VEPonder, ELFasci, DBékés, MDeu, ESalvesen, GSBogyo, M Development of small molecule inhibitors and probes of human SUMO deconjugating proteases. Chem Biol18:722-32 (2011) 
 
Sentrin-specific protease 6
Name:Sentrin-specific protease 6
Type:Enzyme Catalytic Domain
Mol. Mass.:126147.68
Organism:Homo sapiens (Human)
Description:Q9GZR1
Residue:1112
BDBM81513
NameBDBM81513
Synonyms:VEA-422
TypeSmall organic molecule
Emp. Form.C38H33N5O8
Mol. Mass.687.6973
SMILESNC(=O)[C@H](CC(O)=O)NC(=O)c1ccc(cc1)C(=O)NNC(=O)[C@H]1O[C@@H]1C(=O)N(Cc1cccc2ccccc12)Cc1cccc2ccccc12