Reaction Details
TargetTyrosine-protein kinase ABL1
LigandBDBM81735
Substrate/Competitorn/a
Meas. Tech.Kinase Assay
pH7.4±0
Temperature298.15±0 K
IC50 7± 2 nM
Citation Zhou, TParillon, LLi, FWang, YKeats, JLamore, SXu, QShakespeare, WDalgarno, DZhu, X Crystal structure of the T315I mutant of AbI kinase. Chem Biol Drug Des70:171-81 (2007) 
 
Tyrosine-protein kinase ABL1
Name:Tyrosine-protein kinase ABL1
Type:Enzyme
Mol. Mass.:122897.30
Organism:Homo sapiens (Human)
Description:P00519
Residue:1130
BDBM81735
NameBDBM81735
Synonyms:PPY-B
TypeSmall organic molecule
Emp. Form.C23H21N3O2
Mol. Mass.371.4317
SMILESCOc1ccccc1-c1c[nH]c2ncc(cc12)-c1cccc(c1)C(=O)N(C)C