Reaction Details
TargetOxytocin receptor
LigandBDBM81889
Substrate/Competitorn/a
Ki 4.3±n/a nM
CommentsPDSP_1039
Citation Pettibone, DJClineschmidt, BVLis, EVReiss, DRTotaro, JAWoyden, CJBock, MGFreidinger, RMTung, RDVeber, DF In vitro pharmacological profile of a novel structural class of oxytocin antagonists. J Pharmacol Exp Ther256:304-8 (1991) Oxytocin receptor
Name:Oxytocin receptor
Type:Enzyme Catalytic Domain
Mol. Mass.:42889.28
Organism:RAT
Description:Oxytocin OXTR RAT::P70536
Residue:388
BDBM81889
NameBDBM81889
Synonyms:Cyclo[L-Pro-D-Phe-L-Ile-1,6-didehydro-D-Pyz-5-[(dimethylamino)methyl]-L-Pyz-N-methyl-D-Phe-] L-366,670
TypeSmall organic molecule
Emp. Form.C43H59N9O6
Mol. Mass.797.9853
SMILESCCC(C)C1NC(=O)[C@H](Cc2ccccc2)NC(=O)[C@H]2CCCN2C(=O)[C@H](Cc2ccccc2)N(C)C(=O)[C@H]2CC(CN(C)C)CNN2C(=O)[C@H]2CCC=NN2C1=O