Reaction Details
TargetTyrosine-protein kinase transforming protein Abl
LigandBDBM3010
Substrate/Competitorn/a
Meas. Tech.Kinase Inhibition Assay
IC50 1650±n/a nM
Citation Traxler, PBold, GFrei, JLang, MLydon, NMett, HBuchdunger, EMeyer, TMueller, MFuret, P Use of a pharmacophore model for the design of EGF-R tyrosine kinase inhibitors: 4-(phenylamino)pyrazolo[3,4-d]pyrimidines. J Med Chem40:3601-16 (1997) 
 
Tyrosine-protein kinase transforming protein Abl
Name:Tyrosine-protein kinase transforming protein Abl
Type:Enzyme
Mol. Mass.:81895.89
Organism:Abelson murine leukemia virus
Description:P00521
Residue:746
BDBM3010
NameBDBM3010
Synonyms:3-((3-Chlorophenyl)amino)-4-((3-methylphenyl)amino)-1H-pyrazolo[3,4-d]pyrimidine 4-(Phenylamino)pyrazolo[3,4-d]pyrimidine deriv. 11
TypeSmall organic molecule
Emp. Form.C18H15ClN6
Mol. Mass.350.805
SMILESCc1cccc(Nc2ncnc3n[nH]c(Nc4cccc(Cl)c4)c23)c1