Reaction Details
TargetTyrosine-protein kinase transforming protein Abl
LigandBDBM3011
Substrate/Competitorn/a
Meas. Tech.Kinase Inhibition Assay
IC50>10000±n/a nM
Citation Traxler, PBold, GFrei, JLang, MLydon, NMett, HBuchdunger, EMeyer, TMueller, MFuret, P Use of a pharmacophore model for the design of EGF-R tyrosine kinase inhibitors: 4-(phenylamino)pyrazolo[3,4-d]pyrimidines. J Med Chem40:3601-16 (1997) 
 
Tyrosine-protein kinase transforming protein Abl
Name:Tyrosine-protein kinase transforming protein Abl
Type:Enzyme
Mol. Mass.:81895.89
Organism:Abelson murine leukemia virus
Description:P00521
Residue:746
BDBM3011
NameBDBM3011
Synonyms:3-((4-Methoxyphenyl)-amino)-4-((3-chlorophenyl)amino)-1H-pyrazolo[3,4-d]pyrimidine 4-N-(3-chlorophenyl)-3-N-(4-methoxyphenyl)-1H-pyrazolo[3,4-d]pyrimidine-3,4-diamine
TypeSmall organic molecule
Emp. Form.C18H15ClN6O
Mol. Mass.366.804
SMILESCOc1ccc(Nc2[nH]nc3ncnc(Nc4cccc(Cl)c4)c23)cc1