Reaction Details
TargetTyrosine-protein kinase transforming protein Abl
LigandBDBM3012
Substrate/Competitorn/a
Meas. Tech.Kinase Inhibition Assay
IC50 150±n/a nM
Citation Traxler, PBold, GFrei, JLang, MLydon, NMett, HBuchdunger, EMeyer, TMueller, MFuret, P Use of a pharmacophore model for the design of EGF-R tyrosine kinase inhibitors: 4-(phenylamino)pyrazolo[3,4-d]pyrimidines. J Med Chem40:3601-16 (1997) 
 
Tyrosine-protein kinase transforming protein Abl
Name:Tyrosine-protein kinase transforming protein Abl
Type:Enzyme
Mol. Mass.:81895.89
Organism:Abelson murine leukemia virus
Description:P00521
Residue:746
BDBM3012
NameBDBM3012
Synonyms:3-((4-Hydroxyphenyl)amino)-4-((3-chlorophenyl)amino)-1H-pyrazolo[3,4-d]pyrimidine 4-({4-[(3-chlorophenyl)amino]-1H-pyrazolo[3,4-d]pyrimidin-3-yl}amino)phenol
TypeSmall organic molecule
Emp. Form.C17H13ClN6O
Mol. Mass.352.778
SMILESOc1ccc(Nc2[nH]nc3ncnc(Nc4cccc(Cl)c4)c23)cc1