Reaction Details
TargetTyrosine-protein kinase transforming protein Abl
LigandBDBM3020
Substrate/Competitorn/a
Meas. Tech.Kinase Inhibition Assay
IC50 3500±n/a nM
Citation Traxler, PBold, GFrei, JLang, MLydon, NMett, HBuchdunger, EMeyer, TMueller, MFuret, P Use of a pharmacophore model for the design of EGF-R tyrosine kinase inhibitors: 4-(phenylamino)pyrazolo[3,4-d]pyrimidines. J Med Chem40:3601-16 (1997) 
 
Tyrosine-protein kinase transforming protein Abl
Name:Tyrosine-protein kinase transforming protein Abl
Type:Enzyme
Mol. Mass.:81895.89
Organism:Abelson murine leukemia virus
Description:P00521
Residue:746
BDBM3020
NameBDBM3020
Synonyms:3-((3-Methoxybenzyl)amino)-4-((3-chlorophenyl)amino)-1H-pyrazolo[3,4-d]pyrimidine 4-N-(3-chlorophenyl)-3-N-[(3-methoxyphenyl)methyl]-1H-pyrazolo[3,4-d]pyrimidine-3,4-diamine
TypeSmall organic molecule
Emp. Form.C19H17ClN6O
Mol. Mass.380.831
SMILESCOc1cccc(CNc2[nH]nc3ncnc(Nc4cccc(Cl)c4)c23)c1