Reaction Details
TargetTyrosine-protein kinase transforming protein Abl
LigandBDBM3023
Substrate/Competitorn/a
Meas. Tech.Kinase Inhibition Assay
IC50 180±n/a nM
Citation Traxler, PBold, GFrei, JLang, MLydon, NMett, HBuchdunger, EMeyer, TMueller, MFuret, P Use of a pharmacophore model for the design of EGF-R tyrosine kinase inhibitors: 4-(phenylamino)pyrazolo[3,4-d]pyrimidines. J Med Chem40:3601-16 (1997) 
 
Tyrosine-protein kinase transforming protein Abl
Name:Tyrosine-protein kinase transforming protein Abl
Type:Enzyme
Mol. Mass.:81895.89
Organism:Abelson murine leukemia virus
Description:P00521
Residue:746
BDBM3023
NameBDBM3023
Synonyms:3-{4-[(3-chlorophenyl)amino]-1H-pyrazolo[3,4-d]pyrimidin-3-yl}phenol | 4-(Phenylamino)pyrazolo[3,4-d]pyrimidine deriv. 24
TypeSmall organic molecule
Emp. Form.C17H12ClN5O
Mol. Mass.337.763
SMILESOc1cccc(c1)-c1[nH]nc2ncnc(Nc3cccc(Cl)c3)c12