Reaction Details
TargetTyrosine-protein kinase transforming protein Abl
LigandBDBM3030
Substrate/Competitorn/a
Meas. Tech.Kinase Inhibition Assay
IC50>10000±n/a nM
Citation Traxler, PBold, GFrei, JLang, MLydon, NMett, HBuchdunger, EMeyer, TMueller, MFuret, P Use of a pharmacophore model for the design of EGF-R tyrosine kinase inhibitors: 4-(phenylamino)pyrazolo[3,4-d]pyrimidines. J Med Chem40:3601-16 (1997) 
 
Tyrosine-protein kinase transforming protein Abl
Name:Tyrosine-protein kinase transforming protein Abl
Type:Enzyme
Mol. Mass.:81895.89
Organism:Abelson murine leukemia virus
Description:P00521
Residue:746
BDBM3030
NameBDBM3030
Synonyms:4-(3-chlorophenoxy)-N-(3-chlorophenyl)-1H-pyrazolo[3,4-d]pyrimidin-3-amine | 4-(Phenylamino)pyrazolo[3,4-d]pyrimidine deriv. 31
TypeSmall organic molecule
Emp. Form.C17H11Cl2N5O
Mol. Mass.372.208
SMILESClc1cccc(Nc2[nH]nc3ncnc(Oc4cccc(Cl)c4)c23)c1