Reaction Details
TargetTyrosine-protein kinase transforming protein Abl
LigandBDBM3031
Substrate/Competitorn/a
Meas. Tech.Kinase Inhibition Assay
IC50>10000±n/a nM
Citation Traxler, PBold, GFrei, JLang, MLydon, NMett, HBuchdunger, EMeyer, TMueller, MFuret, P Use of a pharmacophore model for the design of EGF-R tyrosine kinase inhibitors: 4-(phenylamino)pyrazolo[3,4-d]pyrimidines. J Med Chem40:3601-16 (1997) 
 
Tyrosine-protein kinase transforming protein Abl
Name:Tyrosine-protein kinase transforming protein Abl
Type:Enzyme
Mol. Mass.:81895.89
Organism:Abelson murine leukemia virus
Description:P00521
Residue:746
BDBM3031
NameBDBM3031
Synonyms:3-((3-Chlorophenyl)amino)-4-(benzylamino)-1H-pyrazolo[3,4-d]pyrimidine 4-N-benzyl-3-N-(3-chlorophenyl)-1H-pyrazolo[3,4-d]pyrimidine-3,4-diamine
TypeSmall organic molecule
Emp. Form.C18H15ClN6
Mol. Mass.350.805
SMILESClc1cccc(Nc2[nH]nc3ncnc(NCc4ccccc4)c23)c1