Reaction Details
TargetCytochrome P450 2C8
LigandBDBM50305083
Substrate/Competitorn/a
Meas. Tech.CYP Enzyme Inhibition Assay
pH7.4±n/a
Temperature310.15±n/a K
IC50>30000±0.0 nM
Commentsextracted
Citation Li, YPrakash, SRXia, CQLiao, MM Inhibitor of breast cancer resistance protein (BCRP) US Patent US9695174 Publication Date 7/4/2017
 
Cytochrome P450 2C8
Name:Cytochrome P450 2C8
Type:Protein
Mol. Mass.:55839.23
Organism:Homo sapiens (Human)
Description:P10632
Residue:490
BDBM50305083
NameBDBM50305083
Synonyms:3-((3S,6S)-6-Isobutyl-9-methoxy-1,4-dioxo-1,2,3,4,6,7,12,12a-octahydro-pyrazino[1',2':1,6]pyrido[3,4-b]indol-3-yl)-propionic acid tert-butyl ester CHEMBL488910 Ko143 | US9695174, Ko143
TypeSmall organic molecule
Emp. Form.C26H35N3O5
Mol. Mass.469.5732
SMILESCOc1ccc2c3C[C@@H]4N([C@@H](CC(C)C)c3[nH]c2c1)C(=O)[C@H](CCC(=O)OC(C)(C)C)NC4=O