Reaction Details
TargetCannabinoid receptor 1
LigandBDBM82139
Substrate/Competitorn/a
Meas. Tech.Binding Assay
pH7.4±0
Temperature298.15±0 K
Ki 24.1±2.2 nM
Citation Mazzoni, ODiurno, MVdi Bosco, AMNovellino, EGrieco, PEsposito, GBertamino, ACalignano, ARusso, R Synthesis and pharmacological evaluation of analogs of indole-based cannabimimetic agents. Chem Biol Drug Des75:106-14 (2010) 
 
Cannabinoid receptor 1
Name:Cannabinoid receptor 1
Type:G Protein-Coupled Receptor (GPCR)
Mol. Mass.:52856.55
Organism:Rattus norvegicus (rat)
Description:P20272
Residue:473
BDBM82139
NameBDBM82139
Synonyms:4-chloro-N-({1-[2-(morpholin-4-yl)ethyl]-1H-indol-3-yl}methyl)aniline, 9
TypeSmall organic molecule
Emp. Form.C21H24ClN3O
Mol. Mass.369.888
SMILESClc1ccc(NCc2cn(CCN3CCOCC3)c3ccccc23)cc1