Reaction Details
TargetType-2 angiotensin II receptor
LigandBDBM82258
Substrate/Competitorn/a
Ki 33.8±n/a nM
CommentsPDSP_1089
Citation Kushida, HNomura, SMorita, OHarasawa, YSuzuki, MNakano, MOzawa, KKunihara, M Pharmacological characterization of the nonpeptide angiotensin II receptor antagonist, U-97018. J Pharmacol Exp Ther274:1042-53 (1995) Type-2 angiotensin II receptor
Name:Type-2 angiotensin II receptor
Type:Enzyme Catalytic Domain
Mol. Mass.:41346.62
Organism:RAT
Description:Angiotensin II AT2 0 0::P35351
Residue:363
BDBM82258
NameBDBM82258
Synonyms:CAS_114798-26-4 NSC_3961
TypeSmall organic molecule
Emp. Form.C22H23ClN6O
Mol. Mass.422.911
SMILESCCCCc1nc(Cl)c(CO)n1Cc1ccc(cc1)-c1ccccc1-c1nnn[nH]1