Reaction Details
TargetGlycogen synthase kinase-3 beta
LigandBDBM84529
Substrate/Competitorn/a
Meas. Tech.Kinase Assay
pH7.5±0
Temperature303.15±0 K
IC50 6±0.0 nM
Citation Kunick, CZeng, ZGussio, RZaharevitz, DLeost, MTotzke, FSchächtele, CKubbutat, MHMeijer, LLemcke, T Structure-aided optimization of kinase inhibitors derived from alsterpaullone. Chembiochem6:541-9 (2005) 
 
Glycogen synthase kinase-3 beta
Name:Glycogen synthase kinase-3 beta
Type:Enzyme
Mol. Mass.:46756.38
Organism:Homo sapiens (Human)
Description:P49841
Residue:420
BDBM84529
NameBDBM84529
Synonyms:Alsterpaullone derivative, 3
TypeSmall organic molecule
Emp. Form.C20H20N4O3
Mol. Mass.364.3978
SMILESNCCCCc1ccc2NC(=O)Cc3c([nH]c4ccc(cc34)[N+]([O-])=O)-c2c1