Reaction Details
TargetLysosomal acid glucosylceramidase
LigandBDBM18046
Substrate/CompetitorBDBM84613
Meas. Tech.Inhibiton Assay
pH5.5±0
Temperature310.15±0 K
IC50 7.8e+3±n/a nM
Citation Tropak, MBKornhaber, GJRigat, BAMaegawa, GHButtner, JDBlanchard, JEMurphy, CTuske, SJCoales, SJHamuro, YBrown, EDMahuran, DJ Identification of pharmacological chaperones for Gaucher disease and characterization of their effects on beta-glucocerebrosidase by hydrogen/deuterium exchange mass spectrometry. Chembiochem9:2650-62 (2008) 
 
Lysosomal acid glucosylceramidase
Name:Lysosomal acid glucosylceramidase
Type:Enzyme
Mol. Mass.:59724.64
Organism:Homo sapiens (Human)
Description:The beta-Glu activity was measured with commercially available beta-glucocerebrosidase (Ceredase) as the enzyme source.
Residue:536
BDBM18046
BDBM84613
NameBDBM18046
Synonyms:5-((4-methylphenyl)thio)-quinazoline 2,4-diamine, 1 5-[(4-methylphenyl)sulfanyl]quinazoline-2,4-diamine CHEMBL83547 | GW578
TypeSmall organic molecule
Emp. Form.C15H14N4S
Mol. Mass.282.363
SMILESCc1ccc(Sc2cccc3nc(N)nc(N)c23)cc1