Reaction Details
TargetVascular endothelial growth factor receptor 3
LigandBDBM84650
Substrate/Competitorn/a
Meas. Tech.In Vitro Kinase Assay
pH7.5±0
Temperature277.15±0 K
IC50 4.2e+3±n/a nM
Citation Sardon, TCottin, TXu, JGiannis, AVernos, I Development and biological evaluation of a novel aurora A kinase inhibitor. Chembiochem10:464-78 (2009) 
 
Vascular endothelial growth factor receptor 3
Name:Vascular endothelial growth factor receptor 3
Type:Protein
Mol. Mass.:152749.58
Organism:Homo sapiens (Human)
Description:P35916-2
Residue:1363
BDBM84650
NameBDBM84650
Synonyms:TC-34
TypeSmall organic molecule
Emp. Form.C20H23N3O2
Mol. Mass.337.4155
SMILESCC(C)Nc1nc(nc2ccc(C=CC(C)(C)O)cc12)-c1ccco1