Reaction Details
TargetGlycine hydroxymethyltransferase
LigandBDBM50239651
Substrate/Competitorn/a
Meas. Tech.ChEMBL_1666642 (CHEMBL4016438)
IC50 1202±n/a nM
Citation Schwertz, GWitschel, MCRottmann, MBonnert, RLeartsakulpanich, UChitnumsub, PJaruwat, AIttarat, WSchäfer, AAponte, RACharman, SAWhite, KLKundu, ASadhukhan, SLloyd, MFreiberg, GMSrikumaran, MSiggel, MZwyssig, AChaiyen, PDiederich, F Antimalarial Inhibitors Targeting Serine Hydroxymethyltransferase (SHMT) with in Vivo Efficacy and Analysis of their Binding Mode Based on X-ray Cocrystal Structures. J Med Chem60:4840-4860 (2017) 
 
Glycine hydroxymethyltransferase
Name:Glycine hydroxymethyltransferase
Type:PROTEIN
Mol. Mass.:49787.58
Organism:Plasmodium falciparum
Description:ChEMBL_117520
Residue:442
BDBM50239651
NameBDBM50239651
Synonyms:CHEMBL4099248
TypeSmall organic molecule
Emp. Form.C24H22F3N5O3S2
Mol. Mass.549.588
SMILESCN(C)S(=O)(=O)c1ccc(s1)-c1cc(cc(c1)C1(C2CC2)c2c(C)[nH]nc2OC(N)=C1C#N)C(F)(F)F