Reaction Details
TargetGlycine hydroxymethyltransferase
LigandBDBM50239678
Substrate/Competitorn/a
Meas. Tech.ChEMBL_1666642 (CHEMBL4016438)
IC50 388±n/a nM
Citation Schwertz, GWitschel, MCRottmann, MBonnert, RLeartsakulpanich, UChitnumsub, PJaruwat, AIttarat, WSchäfer, AAponte, RACharman, SAWhite, KLKundu, ASadhukhan, SLloyd, MFreiberg, GMSrikumaran, MSiggel, MZwyssig, AChaiyen, PDiederich, F Antimalarial Inhibitors Targeting Serine Hydroxymethyltransferase (SHMT) with in Vivo Efficacy and Analysis of their Binding Mode Based on X-ray Cocrystal Structures. J Med Chem60:4840-4860 (2017) 
 
Glycine hydroxymethyltransferase
Name:Glycine hydroxymethyltransferase
Type:PROTEIN
Mol. Mass.:49787.58
Organism:Plasmodium falciparum
Description:ChEMBL_117520
Residue:442
BDBM50239678
NameBDBM50239678
Synonyms:CHEMBL4077713
TypeSmall organic molecule
Emp. Form.C23H18F3N5OS
Mol. Mass.469.482
SMILESCC(C)C1(c2c(C)[nH]nc2OC(N)=C1C#N)c1cc(cc(c1)-c1ccc(s1)C(F)(F)F)C#N