Reaction Details
TargetEukaryotic initiation factor 4A-I
LigandBDBM50239861
Substrate/Competitorn/a
Meas. Tech.ChEMBL_1667493 (CHEMBL4017289)
IC50 57000±n/a nM
Citation Iwatani-Yoshihara, MIto, MKlein, MGYamamoto, TYonemori, KTanaka, TMiwa, MMorishita, DEndo, STjhen, RQin, LNakanishi, AMaezaki, HKawamoto, T Discovery of Allosteric Inhibitors Targeting the Spliceosomal RNA Helicase Brr2. J Med Chem60:5759-5771 (2017) 
 
Eukaryotic initiation factor 4A-I
Name:Eukaryotic initiation factor 4A-I
Type:PROTEIN
Mol. Mass.:46146.87
Organism:Homo sapiens (Human)
Description:ChEMBL_864983
Residue:406
BDBM50239861
NameBDBM50239861
Synonyms:CHEMBL4092701
TypeSmall organic molecule
Emp. Form.C23H20N4O4S
Mol. Mass.448.494
SMILESOC(=O)c1cccc(c1)-c1ccc(\C=C2/C(=O)N=C3SC(=NN3C2=N)C2CCCCC2)o1