Reaction Details
TargetEukaryotic initiation factor 4A-I
LigandBDBM50239863
Substrate/Competitorn/a
Meas. Tech.ChEMBL_1667493 (CHEMBL4017289)
IC50>100000±n/a nM
Citation Iwatani-Yoshihara, MIto, MKlein, MGYamamoto, TYonemori, KTanaka, TMiwa, MMorishita, DEndo, STjhen, RQin, LNakanishi, AMaezaki, HKawamoto, T Discovery of Allosteric Inhibitors Targeting the Spliceosomal RNA Helicase Brr2. J Med Chem60:5759-5771 (2017) 
 
Eukaryotic initiation factor 4A-I
Name:Eukaryotic initiation factor 4A-I
Type:PROTEIN
Mol. Mass.:46146.87
Organism:Homo sapiens (Human)
Description:ChEMBL_864983
Residue:406
BDBM50239863
NameBDBM50239863
Synonyms:CHEMBL4087449
TypeSmall organic molecule
Emp. Form.C29H25FN4O3
Mol. Mass.496.5322
SMILESCc1cc2CCC(Oc2cc1N1Cc2cn(Cc3ccccc3)c(=O)cc2NC1=O)c1ncccc1F