Reaction Details
TargetMacrophage colony-stimulating factor 1 receptor
LigandBDBM50240218
Substrate/Competitorn/a
Meas. Tech.ChEMBL_1667795 (CHEMBL4017683)
IC50 4.0±n/a nM
Citation Ramachandran, SAJadhavar, PSMiglani, SKSingh, MPKalane, DPAgarwal, AKSathe, BDMukherjee, KGupta, AHaldar, SRaja, MSingh, SPham, SMChakravarty, SQuinn, KBelmar, SAlfaro, IEHiggs, CBernales, SHerrera, FJRai, R Design, synthesis and optimization of bis-amide derivatives as CSF1R inhibitors. Bioorg Med Chem Lett27:2153-2160 (2017) 
 
Macrophage colony-stimulating factor 1 receptor
Name:Macrophage colony-stimulating factor 1 receptor
Type:Protein
Mol. Mass.:107979.48
Organism:Homo sapiens (Human)
Description:P07333
Residue:972
BDBM50240218
NameBDBM50240218
Synonyms:CHEMBL4059858
TypeSmall organic molecule
Emp. Form.C33H32F3N5O2
Mol. Mass.587.6347
SMILESCN1CCN(Cc2ccc(cc2C(F)(F)F)C(=O)Nc2ccc(C)c(NC(=O)c3cccc(c3)-c3cccnc3)c2)CC1