Reaction Details
TargetSodium channel protein type 9 subunit alpha
LigandBDBM50240277
Substrate/Competitorn/a
Meas. Tech.ChEMBL_1667926 (CHEMBL4017814)
IC50 8.0±n/a nM
Citation Roecker, AJEgbertson, MJones, KLGGomez, RKraus, RLLi, YKoser, AJUrban, MOKlein, RClements, MPanigel, JDaley, CWang, JFinger, ENMajercak, JSantarelli, VGregan, ICato, MFilzen, TJovanovska, AWang, YHWang, DJoyce, LASherer, ECPeng, XWang, XSun, HColeman, PJHoughton, AKLayton, ME Discovery of selective, orally bioavailable, N-linked arylsulfonamide Na Bioorg Med Chem Lett27:2087-2093 (2017) 
 
Sodium channel protein type 9 subunit alpha
Name:Sodium channel protein type 9 subunit alpha
Type:Protein
Mol. Mass.:226375.97
Organism:Homo sapiens (Human)
Description:Q15858
Residue:1988
BDBM50240277
NameBDBM50240277
Synonyms:CHEMBL4061793
TypeSmall organic molecule
Emp. Form.C17H20ClFN4O2S2
Mol. Mass.430.948
SMILESFc1cc(NCC23CCCN2CCC3)c(Cl)cc1S(=O)(=O)Nc1nccs1