Reaction Details
TargetHistone deacetylase 1
LigandBDBM50241450
Substrate/Competitorn/a
Meas. Tech.ChEMBL_1669855 (CHEMBL4019743)
IC50 21±n/a nM
Citation Dong, GChen, WWang, XYang, XXu, TWang, PZhang, WRao, YMiao, CSheng, C Small Molecule Inhibitors Simultaneously Targeting Cancer Metabolism and Epigenetics: Discovery of Novel Nicotinamide Phosphoribosyltransferase (NAMPT) and Histone Deacetylase (HDAC) Dual Inhibitors. J Med Chem60:7965-7983 (2017) 
 
Histone deacetylase 1
Name:Histone deacetylase 1
Type:Enzyme
Mol. Mass.:55090.27
Organism:Homo sapiens (Human)
Description:Q13547
Residue:482
BDBM50241450
NameBDBM50241450
Synonyms:CHEMBL4072816
TypeSmall organic molecule
Emp. Form.C20H18ClN5O2
Mol. Mass.395.842
SMILESNc1ccccc1NC(=O)c1ccc(NC(=O)NCc2ccc(Cl)nc2)cc1