Reaction Details
TargetGlycogen phosphorylase, muscle form
LigandBDBM50241632
Substrate/Competitorn/a
Meas. Tech.ChEMBL_1670148 (CHEMBL4020036)
Ki 191±n/a nM
Citation Bokor, ÉKyriakis, ESolovou, TGAKoppány, CKantsadi, ALSzabó, KESzakács, AStravodimos, GADocsa, TSkamnaki, VTZographos, SEGergely, PLeonidas, DDSomsák, L Nanomolar Inhibitors of Glycogen Phosphorylase Based on?-d-Glucosaminyl Heterocycles: A Combined Synthetic, Enzyme Kinetic, and Protein Crystallography Study. J Med Chem60:9251-9262 (2017) 
 
Glycogen phosphorylase, muscle form
Name:Glycogen phosphorylase, muscle form
Type:Enzyme
Mol. Mass.:97296.32
Organism:Oryctolagus cuniculus (rabbit)
Description:Phosphorylation of Ser-15 converts phosphorylase B (unphosphorylated) to phosphorylase A.
Residue:843
BDBM50241632
NameBDBM50241632
Synonyms:CHEMBL4101331
TypeSmall organic molecule
Emp. Form.C19H21N3O4
Mol. Mass.355.3877
SMILESN[C@@H]1[C@@H](O)[C@H](O)[C@@H](CO)O[C@H]1c1nc(c[nH]1)-c1ccc2ccccc2c1