Reaction Details
TargetMuscarinic acetylcholine receptor M1
LigandBDBM50004656
Substrate/Competitorn/a
Meas. Tech.ChEMBL_1676735 (CHEMBL4026878)
Ki 63000±n/a nM
Citation Fish, IStößel, AEitel, KValant, CAlbold, SHuebner, HMöller, DClark, MJSunahara, RKChristopoulos, AShoichet, BKGmeiner, P Structure-Based Design and Discovery of New M J Med Chem60:9239-9250 (2017) 
 
Muscarinic acetylcholine receptor M1
Name:Muscarinic acetylcholine receptor M1
Type:Protein
Mol. Mass.:51442.54
Organism:Homo sapiens (Human)
Description:P11229
Residue:460
BDBM50004656
NameBDBM50004656
Synonyms:(2-Carbamoyloxy-ethyl)-trimethyl-ammonium (2-Hydroxyethyl)trimethyl ammonium chloride carbamate (carbachol)(2-Carbamoyloxy-ethyl)-trimethyl-ammonium 2-((Aminocarbonyl)oxy)-N,N,N-trimethylethanaminum chloride 2-(carbamoyloxy)-N,N,N-trimethylethanaminium chloride CARBASTAT Carbachol chloride Choline carbamate chloride Choline chlorine carbamate Karbamoylcholin chlorid | MIOSTAT
TypeSmall organic molecule
Emp. Form.C6H15N2O2
Mol. Mass.147.195
SMILESC[N+](C)(C)CCOC(N)=O