Reaction Details
TargetMuscarinic acetylcholine receptor M1
LigandBDBM50246724
Substrate/Competitorn/a
Meas. Tech.ChEMBL_1676735 (CHEMBL4026878)
Ki 2500±n/a nM
Citation Fish, IStößel, AEitel, KValant, CAlbold, SHuebner, HMöller, DClark, MJSunahara, RKChristopoulos, AShoichet, BKGmeiner, P Structure-Based Design and Discovery of New M J Med Chem60:9239-9250 (2017) 
 
Muscarinic acetylcholine receptor M1
Name:Muscarinic acetylcholine receptor M1
Type:Protein
Mol. Mass.:51442.54
Organism:Homo sapiens (Human)
Description:P11229
Residue:460
BDBM50246724
NameBDBM50246724
Synonyms:CHEMBL4085451
TypeSmall organic molecule
Emp. Form.C14H22INO
Mol. Mass.347.2351
SMILES[I-].COc1cccc2CC(CCc12)[N+](C)(C)C