Reaction Details
TargetMuscarinic acetylcholine receptor M1
LigandBDBM50246652
Substrate/Competitorn/a
Meas. Tech.ChEMBL_1676735 (CHEMBL4026878)
Ki 170±n/a nM
Citation Fish, IStößel, AEitel, KValant, CAlbold, SHuebner, HMöller, DClark, MJSunahara, RKChristopoulos, AShoichet, BKGmeiner, P Structure-Based Design and Discovery of New M J Med Chem60:9239-9250 (2017) 
 
Muscarinic acetylcholine receptor M1
Name:Muscarinic acetylcholine receptor M1
Type:Protein
Mol. Mass.:51442.54
Organism:Homo sapiens (Human)
Description:P11229
Residue:460
BDBM50246652
NameBDBM50246652
Synonyms:CHEMBL4102555
TypeSmall organic molecule
Emp. Form.C13H19NO4
Mol. Mass.253.2943
SMILES[O-]C=O.COc1cccc(c1)C(=O)C[N+](C)(C)C