Reaction Details
TargetMuscarinic acetylcholine receptor M2
LigandBDBM50246723
Substrate/Competitorn/a
Meas. Tech.ChEMBL_1676736 (CHEMBL4026879)
Ki 4200±n/a nM
Citation Fish, IStößel, AEitel, KValant, CAlbold, SHuebner, HMöller, DClark, MJSunahara, RKChristopoulos, AShoichet, BKGmeiner, P Structure-Based Design and Discovery of New M J Med Chem60:9239-9250 (2017) 
 
Muscarinic acetylcholine receptor M2
Name:Muscarinic acetylcholine receptor M2
Type:GPCR
Mol. Mass.:51730.61
Organism:Homo sapiens (Human)
Description:P08172
Residue:466
BDBM50246723
NameBDBM50246723
Synonyms:CHEMBL4103087
TypeSmall organic molecule
Emp. Form.C13H20INO
Mol. Mass.333.2085
SMILES[I-].C[N+](C)(C)C1CCc2cccc(O)c2C1