Reaction Details
TargetAdenosine receptor A2b
LigandBDBM50242086
Substrate/Competitorn/a
Meas. Tech.ChEMBL_1671313 (CHEMBL4021342)
Ki 1.5±n/a nM
Citation Basu, SBarawkar, DARamdas, VPatel, MWaman, YPanmand, AKumar, SThorat, SNaykodi, MGoswami, AReddy, BSPrasad, VChaturvedi, SQuraishi, AMenon, SPaliwal, SKulkarni, AKarande, VGhosh, IMustafa, SDe, SJain, VBanerjee, ERRouduri, SRPalle, VPChugh, AMookhtiar, KA Design and synthesis of novel xanthine derivatives as potent and selective A Eur J Med Chem134:218-229 (2017) 
 
Adenosine receptor A2b
Name:Adenosine receptor A2b
Type:G Protein-Coupled Receptor (GPCR)
Mol. Mass.:36341.22
Organism:Homo sapiens (Human)
Description:n/a
Residue:332
BDBM50242086
NameBDBM50242086
Synonyms:CHEMBL4088514
TypeSmall organic molecule
Emp. Form.C24H23F3N6O2
Mol. Mass.484.4736
SMILESCCCn1c2nc([nH]c2c(=O)n(CCC)c1=O)-c1cnn(CC#Cc2ccc(cc2)C(F)(F)F)c1