Reaction Details
TargetDisintegrin and metalloproteinase domain-containing protein 17
LigandBDBM50243045
Substrate/Competitorn/a
Meas. Tech.ChEBML_1672502
Ki 0.200000±n/a nM
Citation Tong, LKim, SHRosner, KYu, WShankar, BBChen, LLi, DDai, CGirijavallabhan, VPopovici-Muller, JYang, LZhou, GKosinski, ASiddiqui, MAShih, NYGuo, ZOrth, PChen, SLundell, DNiu, XUmland, SKozlowski, JA Fused bi-heteroaryl substituted hydantoin compounds as TACE inhibitors. Bioorg Med Chem Lett27:3037-3042 (2017) 
 
Disintegrin and metalloproteinase domain-containing protein 17
Name:Disintegrin and metalloproteinase domain-containing protein 17
Type:Enzyme
Mol. Mass.:93007.89
Organism:Homo sapiens (Human)
Description:
Residue:824
BDBM50243045
NameBDBM50243045
Synonyms:CHEMBL4095412
TypeSmall organic molecule
Emp. Form.C20H16N4O6
Mol. Mass.408.3642
SMILESCOc1ccc2CN(C[C@]3(NC(=O)NC3=O)c3cc4c(O)nccc4o3)C(=O)c2c1