Reaction Details
TargetDisintegrin and metalloproteinase domain-containing protein 17
LigandBDBM50243097
Substrate/Competitorn/a
Meas. Tech.ChEBML_1672502
Ki 0.400000±n/a nM
Citation Tong, LKim, SHRosner, KYu, WShankar, BBChen, LLi, DDai, CGirijavallabhan, VPopovici-Muller, JYang, LZhou, GKosinski, ASiddiqui, MAShih, NYGuo, ZOrth, PChen, SLundell, DNiu, XUmland, SKozlowski, JA Fused bi-heteroaryl substituted hydantoin compounds as TACE inhibitors. Bioorg Med Chem Lett27:3037-3042 (2017) 
 
Disintegrin and metalloproteinase domain-containing protein 17
Name:Disintegrin and metalloproteinase domain-containing protein 17
Type:Enzyme
Mol. Mass.:93007.89
Organism:Homo sapiens (Human)
Description:
Residue:824
BDBM50243097
NameBDBM50243097
Synonyms:CHEMBL4060386
TypeSmall organic molecule
Emp. Form.C21H18N4O5
Mol. Mass.406.3914
SMILESCOc1ccc2CN(C[C@]3(NC(=O)NC3=O)c3cc4cnc(C)cc4o3)C(=O)c2c1