Reaction Details
TargetMuscarinic acetylcholine receptor M1
LigandBDBM50003369
Substrate/Competitorn/a
Meas. Tech.ChEMBL_138801 (CHEMBL884860)
IC50 18±n/a nM
Citation Ward, JSMerritt, LKlimkowski, VJLamb, MLMitch, CHBymaster, FPSawyer, BShannon, HEOlesen, PHHonoré, T Novel functional M1 selective muscarinic agonists. 2. Synthesis and structure-activity relationships of 3-pyrazinyl-1,2,5,6-tetrahydro-1-methylpyridines. Construction of a molecular model for the M1 pharmacophore. J Med Chem35:4011-9 (1992) Muscarinic acetylcholine receptor M1
Name:Muscarinic acetylcholine receptor M1
Type:Enzyme Catalytic Domain
Mol. Mass.:51390.46
Organism:RAT
Description:P08482
Residue:460
BDBM50003369
NameBDBM50003369
Synonyms:1-Methyl-5-(4-propoxy-[1,2,5]thiadiazol-3-yl)-1,2,3,6-tetrahydro-pyridine 1-methyl-5-(4-propoxy-1,2,5-thiadiazol-3-yl)-1,2,3,6-tetrahydropyridine CHEMBL308803
TypeSmall organic molecule
Emp. Form.C11H17N3OS
Mol. Mass.239.337
SMILESCCCOc1nsnc1C1=CCCN(C)C1