Reaction Details
TargetType-1 angiotensin II receptor
LigandBDBM50003392
Substrate/Competitorn/a
Meas. Tech.ChEBML_36783
IC50 16±n/a nM
Citation Bradbury, RHAllott, CPDennis, MFisher, EMajor, JSMasek, BBOldham, AAPearce, RJRankine, NRevill, JM New nonpeptide angiotensin II receptor antagonists. 2. Synthesis, biological properties, and structure-activity relationships of 2-alkyl-4-(biphenylylmethoxy)quinoline derivatives. J Med Chem35:4027-38 (1992) Type-1 angiotensin II receptor
Name:Type-1 angiotensin II receptor
Type:PROTEIN
Mol. Mass.:41004.19
Organism:Cavia porcellus
Description:ChEMBL_36783
Residue:359
BDBM50003392
NameBDBM50003392
Synonyms:2-Methyl-4-[2'-(1H-tetrazol-5-yl)-biphenyl-4-ylmethoxy]-quinoline CHEMBL142380
TypeSmall organic molecule
Emp. Form.C24H19N5O
Mol. Mass.393.4406
SMILESCc1cc(OCc2ccc(cc2)-c2ccccc2-c2nnn[nH]2)c2ccccc2n1