Reaction Details
TargetBifunctional purine biosynthesis protein ATIC
LigandBDBM50243462
Substrate/Competitorn/a
Meas. Tech.ChEMBL_1672744 (CHEMBL4022773)
IC50<5.0±n/a nM
Citation Fales, KRNjoroge, FGBrooks, HBThibodeaux, STorrado, ASi, CToth, JLMc Cowan, JRRoth, KDThrasher, KJFrimpong, KLee, MRDally, RDShepherd, TADurham, TBMargolis, BJWu, ZWang, YAtwell, SWang, JHui, YHMeier, TIKonicek, SAGeeganage, S Discovery of N-(6-Fluoro-1-oxo-1,2-dihydroisoquinolin-7-yl)-5-[(3R)-3-hydroxypyrrolidin-1-yl]thiophene-2-sulfonamide (LSN 3213128), a Potent and Selective Nonclassical Antifolate Aminoimidazole-4-carboxamide Ribonucleotide Formyltransferase (AICARFT) Inhibitor Effective at Tumor Suppression in a Can J Med Chem60:9599-9616 (2017) 
 
Bifunctional purine biosynthesis protein ATIC
Name:Bifunctional purine biosynthesis protein ATIC
Type:Protein
Mol. Mass.:64616.62
Organism:Homo sapiens (Human)
Description:P31939
Residue:592
BDBM50243462
NameBDBM50243462
Synonyms:CHEMBL4083899
TypeSmall organic molecule
Emp. Form.C20H18FN3O4S2
Mol. Mass.447.503
SMILESCC1(C)CC(=CNC1=O)c1ccc(s1)S(=O)(=O)Nc1cc2c(cc[nH]c2=O)cc1F