Reaction Details
TargetAcidic mammalian chitinase
LigandBDBM50243745
Substrate/Competitorn/a
Meas. Tech.ChEMBL_1672914 (CHEMBL4022943)
Ki 14±n/a nM
Citation Mazur, MOlczak, JOlejniczak, SKoralewski, RCzestkowski, WJedrzejczak, AGolab, JDzwonek, KDymek, BSklepkiewicz, PLZagozdzon, ANoonan, TMahboubi, KConway, BSheeler, RBeckett, PHungerford, WMPodjarny, AMitschler, ACousido-Siah, AFadel, FGolebiowski, A Targeting Acidic Mammalian chitinase Is Effective in Animal Model of Asthma. J Med Chem61:695-710 (2018) 
 
Acidic mammalian chitinase
Name:Acidic mammalian chitinase
Type:Protein
Mol. Mass.:52266.66
Organism:Homo sapiens (Human)
Description:Q9BZP6
Residue:476
BDBM50243745
NameBDBM50243745
Synonyms:CHEMBL4076989
TypeSmall organic molecule
Emp. Form.C19H29ClN6
Mol. Mass.376.927
SMILESCC(C)CN(CCc1ccc(Cl)cc1)C1CCN(CC1)c1nc(N)n[nH]1