Reaction Details
TargetAcidic mammalian chitinase
LigandBDBM50243685
Substrate/Competitorn/a
Meas. Tech.ChEMBL_1672911 (CHEMBL4022940)
IC50 6.2±n/a nM
Citation Mazur, MOlczak, JOlejniczak, SKoralewski, RCzestkowski, WJedrzejczak, AGolab, JDzwonek, KDymek, BSklepkiewicz, PLZagozdzon, ANoonan, TMahboubi, KConway, BSheeler, RBeckett, PHungerford, WMPodjarny, AMitschler, ACousido-Siah, AFadel, FGolebiowski, A Targeting Acidic Mammalian chitinase Is Effective in Animal Model of Asthma. J Med Chem61:695-710 (2018) 
 
Acidic mammalian chitinase
Name:Acidic mammalian chitinase
Type:PROTEIN
Mol. Mass.:51991.60
Organism:Mus musculus
Description:ChEMBL_828636
Residue:473
BDBM50243685
NameBDBM50243685
Synonyms:CHEMBL4084573
TypeSmall organic molecule
Emp. Form.C26H29ClN6
Mol. Mass.461.002
SMILESNc1n[nH]c(n1)N1CCC(CC1)N(CCc1ccc(Cl)cc1)Cc1cccc2ccccc12