Reaction Details
TargetAcidic mammalian chitinase
LigandBDBM50243744
Substrate/Competitorn/a
Meas. Tech.ChEMBL_1672911 (CHEMBL4022940)
IC50 36±n/a nM
Citation Mazur, MOlczak, JOlejniczak, SKoralewski, RCzestkowski, WJedrzejczak, AGolab, JDzwonek, KDymek, BSklepkiewicz, PLZagozdzon, ANoonan, TMahboubi, KConway, BSheeler, RBeckett, PHungerford, WMPodjarny, AMitschler, ACousido-Siah, AFadel, FGolebiowski, A Targeting Acidic Mammalian chitinase Is Effective in Animal Model of Asthma. J Med Chem61:695-710 (2018) 
 
Acidic mammalian chitinase
Name:Acidic mammalian chitinase
Type:PROTEIN
Mol. Mass.:51991.60
Organism:Mus musculus
Description:ChEMBL_828636
Residue:473
BDBM50243744
NameBDBM50243744
Synonyms:CHEMBL4098997
TypeSmall organic molecule
Emp. Form.C17H25BrN6
Mol. Mass.393.325
SMILESCCN(CCc1ccc(Br)cc1)C1CCN(CC1)c1nc(N)n[nH]1