Reaction Details
TargetCannabinoid receptor 2
LigandBDBM50244253
Substrate/Competitorn/a
Meas. Tech.ChEMBL_1673538 (CHEMBL4023567)
Ki 8900±n/a nM
Citation Dolles, DHoffmann, MGunesch, SMarinelli, OMöller, JSantoni, GChatonnet, ALohse, MJWittmann, HJStrasser, ANabissi, MMaurice, TDecker, M Structure-Activity Relationships and Computational Investigations into the Development of Potent and Balanced Dual-Acting Butyrylcholinesterase Inhibitors and Human Cannabinoid Receptor 2 Ligands with Pro-Cognitive in Vivo Profiles. J Med Chem61:1646-1663 (2018) 
 
Cannabinoid receptor 2
Name:Cannabinoid receptor 2
Type:G Protein-Coupled Receptor (GPCR)
Mol. Mass.:39690.94
Organism:Homo sapiens (Human)
Description:P34972
Residue:360
BDBM50244253
NameBDBM50244253
Synonyms:CHEMBL4074747
TypeSmall organic molecule
Emp. Form.C31H37N5O2
Mol. Mass.511.6578
SMILESCCN(CC)C(=O)c1ccc2n(CCN3CCCCC3)c(Nc3ccc(Oc4ccccc4)cc3)nc2c1