Reaction Details
TargetCannabinoid receptor 2
LigandBDBM50244254
Substrate/Competitorn/a
Meas. Tech.ChEMBL_1673538 (CHEMBL4023567)
Ki 962±n/a nM
Citation Dolles, DHoffmann, MGunesch, SMarinelli, OMöller, JSantoni, GChatonnet, ALohse, MJWittmann, HJStrasser, ANabissi, MMaurice, TDecker, M Structure-Activity Relationships and Computational Investigations into the Development of Potent and Balanced Dual-Acting Butyrylcholinesterase Inhibitors and Human Cannabinoid Receptor 2 Ligands with Pro-Cognitive in Vivo Profiles. J Med Chem61:1646-1663 (2018) 
 
Cannabinoid receptor 2
Name:Cannabinoid receptor 2
Type:G Protein-Coupled Receptor (GPCR)
Mol. Mass.:39690.94
Organism:Homo sapiens (Human)
Description:P34972
Residue:360
BDBM50244254
NameBDBM50244254
Synonyms:CHEMBL4104374
TypeSmall organic molecule
Emp. Form.C21H25N3O3
Mol. Mass.367.4415
SMILESCCOc1ccc(Cc2nc3cc(ccc3n2CCC(C)C)[N+]([O-])=O)cc1