Reaction Details
TargetCannabinoid receptor 2
LigandBDBM50244302
Substrate/Competitorn/a
Meas. Tech.ChEMBL_1673538 (CHEMBL4023567)
IC50 794±n/a nM
Citation Dolles, DHoffmann, MGunesch, SMarinelli, OMöller, JSantoni, GChatonnet, ALohse, MJWittmann, HJStrasser, ANabissi, MMaurice, TDecker, M Structure-Activity Relationships and Computational Investigations into the Development of Potent and Balanced Dual-Acting Butyrylcholinesterase Inhibitors and Human Cannabinoid Receptor 2 Ligands with Pro-Cognitive in Vivo Profiles. J Med Chem61:1646-1663 (2018) 
 
Cannabinoid receptor 2
Name:Cannabinoid receptor 2
Type:G Protein-Coupled Receptor (GPCR)
Mol. Mass.:39690.94
Organism:Homo sapiens (Human)
Description:P34972
Residue:360
BDBM50244302
NameBDBM50244302
Synonyms:CHEMBL4061358
TypeSmall organic molecule
Emp. Form.C27H37N3O2
Mol. Mass.435.6016
SMILESCCOc1ccc(Cc2nc3cc(ccc3n2CCC(C)C)C(=O)NCCC(C)C)cc1