Reaction Details
TargetCannabinoid receptor 2
LigandBDBM50244242
Substrate/Competitorn/a
Meas. Tech.ChEMBL_1673538 (CHEMBL4023567)
Ki 188±n/a nM
Citation Dolles, DHoffmann, MGunesch, SMarinelli, OMöller, JSantoni, GChatonnet, ALohse, MJWittmann, HJStrasser, ANabissi, MMaurice, TDecker, M Structure-Activity Relationships and Computational Investigations into the Development of Potent and Balanced Dual-Acting Butyrylcholinesterase Inhibitors and Human Cannabinoid Receptor 2 Ligands with Pro-Cognitive in Vivo Profiles. J Med Chem61:1646-1663 (2018) 
 
Cannabinoid receptor 2
Name:Cannabinoid receptor 2
Type:G Protein-Coupled Receptor (GPCR)
Mol. Mass.:39690.94
Organism:Homo sapiens (Human)
Description:P34972
Residue:360
BDBM50244242
NameBDBM50244242
Synonyms:CHEMBL4082936
TypeSmall organic molecule
Emp. Form.C28H38N4O2
Mol. Mass.462.6269
SMILESCCOc1ccc(Cc2nc3cc(ccc3n2CCN2CCCCC2)C(=O)N(CC)CC)cc1